StartTime,Dur,Proto,SrcAddr,Sport,Dir,DstAddr,Dport,State,sTos,dTos,TotPkts,TotBytes,SrcBytes,srcUdata,dstUdata,Label
1970/01/01 01:00:00.000000,0.000000,llc,00:00:00:00:00:00,,   ->,00:00:00:00:00:00,,INT,,,1,60,60,,,
1970/01/01 01:00:07.468895,3507.683105,udp,fe80::d08d:ffd6:56a5:c2db,546,   ->,ff02::1:2,547,INT,0,,63,9198,9198,s[640]=AY1dYQAIAAIAAAABAA4AAQABF1HDIggAJzyNyQADAAwOCAAnAAAAAAAAAAAAJwAGAARXSU43ABAADgAAATcACE1TRlQgNS4wAAYACAAYABcAEQAnAY1dYQAIAAIAZAABAA4AAQABF1HDIggAJzyNyQADAAwOCAAnAAAAAAAAAAAAJwAGAARXSU43ABAADgAAATcACE1TRlQgNS4wAAYACAAYABcAEQAnAY1dYQAIAAKhpAABAA4AAQABF1HDIggAJzyNyQADAAwOCAAnAAAAAAAAAAAAJwAGAARXSU43ABAADgAAATcACE1TRlQgNS4wAAYACAAYABcAEQAnAY1dYQAIAAKjNAABAA4AAQABF1HDIggAJzyNyQADAAwOCAAnAAAAAAAAAAAAJwAGAARXSU43ABAADgAAATcACE1TRlQgNS4wAAYACAAYABcAEQAnAY1dYQAIAAKmVAABAA4AAQABF1HDIggAJzyNyQADAAwOCAAnAAAAAAAAAAAAJwAGAARXSU43ABAADgAAATcACE1TRlQgNS4wAAYACAAYABcAEQAnAY1dYQAIAAKslAABAA4AAQABF1HDIggAJzyNyQADAAwOCAAnAAAAAAAAAAAAJwAGAARXSU43ABAADgAA,,
1970/01/01 01:00:07.654512,3048.394531,arp,10.0.2.107,,  who,10.0.2.2,,CON,,,14,588,294,,,
1970/01/01 01:00:07.789266,2.003037,arp,0.0.0.0,,  who,10.0.2.107,,INT,,,3,126,126,,,
1970/01/01 01:00:07.789395,0.000000,ipv6-icmp,::,135,   ->,ff02::1:ffa5:c2db,,NNS,0,,1,78,78,s[32]=hwDOwAAAAAD+gAAAAAAAANCN/9ZWpcLb,,
1970/01/01 01:00:07.789442,8.001512,ipv6-icmp,fe80::d08d:ffd6:56a5:c2db,133,   ->,ff02::2,,NRS,0,,3,210,210,s[64]=hQDrwwAAAAABAQgAJ8F2w4UA68MAAAAAAQEIACfBdsOFAOvDAAAAAAEBCAAnwXbD,,
1970/01/01 01:00:07.789509,0.500878,ipv6-icmp,fe80::d08d:ffd6:56a5:c2db,143,   ->,ff02::16,,UNK,0,,2,180,180,s[76]=jwDDogAAAAEEAAAA/wIAAAAAAAAAAAAB/6XC248Aw6IAAAABBAAAAP8CAAAAAAAAAAAAAf+lwts=,,
1970/01/01 01:00:09.998412,0.000000,udp,10.0.2.107,56376,   ->,8.8.8.8,53,INT,0,,1,76,76,s[48]=l+0BAAABAAAAAAAAA2Rucwhtc2Z0bmNzaQNjb20AAAEAAQ==,,
1970/01/01 01:00:09.999303,0.000139,arp,10.0.2.2,,  who,10.0.2.107,,CON,,,2,84,42,,,
1970/01/01 01:00:10.994024,0.001174,udp,10.0.2.107,56376,  <->,8.8.4.4,53,CON,0,0,2,168,76,s[48]=l+0BAAABAAAAAAAAA2Rucwhtc2Z0bmNzaQNjb20AAAEAAQ==,d[68]=l+2BgAABAAEAAAAAA2Rucwhtc2Z0bmNzaQNjb20AAAEAAcAMAAEAAQAAAAQABINr//8=,
1970/01/01 01:00:10.995729,0.000917,udp,10.0.2.107,54428,  <->,8.8.4.4,53,CON,0,0,2,180,76,s[48]=rxIBAAABAAAAAAAAA2Rucwhtc2Z0bmNzaQNjb20AABwAAQ==,d[84]=rxKBgAABAAEAAAAAA2Rucwhtc2Z0bmNzaQNjb20AABwAAcAMABwAAQAACcwAEP0+T1pbgQAAAAAAAAAAAAE=,
1970/01/01 01:03:57.024910,0.094433,udp,fe80::d08d:ffd6:56a5:c2db,60383,   ->,ff02::1:3,5355,INT,0,,2,168,168,s[60]=vwwAAAABAAAAAAAABHdwYWQAAAEAAb8MAAAAAQAAAAAAAAR3cGFkAAABAAE=,,
1970/01/01 01:03:57.025091,0.094456,udp,10.0.2.107,59437,   ->,224.0.0.252,5355,INT,0,,2,128,128,s[60]=vwwAAAABAAAAAAAABHdwYWQAAAEAAb8MAAAAAQAAAAAAAAR3cGFkAAABAAE=,,
1970/01/01 01:03:57.025189,0.094358,icmp,10.0.2.2,0x000b,   ->,10.0.2.107,,TXD,192,,2,184,184,s[80]=6C0U6wAefUm/DAAAAAEAAAAAAAAEd3BhZAAAAQAB6C0U6wAefUm/DAAAAAEAAAAAAAAEd3BhZAAAAQAB,,
1970/01/01 01:03:57.319282,1.502699,udp,10.0.2.107,137,   ->,10.0.2.255,137,INT,0,,3,276,276,s[200]=4/8BEAABAAAAAAAAIEZIRkFFQkVFQ0FDQUNBQ0FDQUNBQ0FDQUNBQ0FDQUFBAAAgAAHj/wEQAAEAAAAAAAAgRkhGQUVCRUVDQUNBQ0FDQUNBQ0FDQUNBQ0FDQUNBQUEAACAAAeP/ARAAAQAAAAAAACBGSEZBRUJFRUNBQ0FDQUNBQ0FDQUNBQ0FDQUNBQ0FBQQAAIAAB,,
1970/01/01 01:03:57.319435,1.502546,icmp,10.0.2.2,0x0003,   ->,10.0.2.107,0x0a00,URN,192,,3,360,360,s[232]=AIkAiQA6v5Dj/wEQAAEAAAAAAAAgRkhGQUVCRUVDQUNBQ0FDQUNBQ0FDQUNBQ0FDQUNBQUEAACAAAQCJAIkAOr+Q4/8BEAABAAAAAAAAIEZIRkFFQkVFQ0FDQUNBQ0FDQUNBQ0FDQUNBQ0FDQUFBAAAgAAEAiQCJADq/kOP/ARAAAQAAAAAAACBGSEZBRUJFRUNBQ0FDQUNBQ0FDQUNBQ0FDQUNBQ0FBQQAAIAAB,,
1970/01/01 01:03:59.648727,8.996867,tcp,10.0.2.107,49158,   ->,94.126.171.85,8080,S_,0,,3,194,194,,,
1970/01/01 01:04:09.682851,9.006924,tcp,10.0.2.107,49159,   ->,94.176.2.168,8080,S_,0,,3,194,194,,,
1970/01/01 01:04:19.697763,8.996547,tcp,10.0.2.107,49160,   ->,76.74.252.88,8080,S_,0,,3,194,194,,,
1970/01/01 01:04:20.565027,0.001012,udp,10.0.2.107,54304,  <->,8.8.8.8,53,CON,0,0,2,168,76,s[48]=YQMBAAABAAAAAAAAA2Rucwhtc2Z0bmNzaQNjb20AAAEAAQ==,d[68]=YQOBgAABAAEAAAAAA2Rucwhtc2Z0bmNzaQNjb20AAAEAAcAMAAEAAQAAAAYABINr//8=,
1970/01/01 01:04:20.566469,0.000946,udp,10.0.2.107,57946,  <->,8.8.8.8,53,CON,0,0,2,180,76,s[48]=KZsBAAABAAAAAAAAA2Rucwhtc2Z0bmNzaQNjb20AABwAAQ==,d[84]=KZuBgAABAAEAAAAAA2Rucwhtc2Z0bmNzaQNjb20AABwAAcAMABwAAQAACNMAEP0+T1pbgQAAAAAAAAAAAAE=,
1970/01/01 01:04:29.715283,21.291260,tcp,10.0.2.107,49161,   ->,46.32.233.226,8080,SRPA_FSPA,0,0,64,60646,1357,s[572]=UE9TVCAvMTM4OTkwODAyMS8zNzMyNjk0MTEucGhwIEhUVFAvMS4xDQpBY2NlcHQ6ICovKg0KVXNlci1BZ2VudDogTW96aWxsYS81LjAgKGNvbXBhdGlibGU7IE1TSUUgOS4wOyBXaW5kb3dzIE5UIDcuMTsgVHJpZGVudC81LjApDQpIb3N0OiA0Ni4zMi4yMzMuMjI2OjgwODANCkNvbnRlbnQtTGVuZ3RoOiAxOTgNCkNvbm5lY3Rpb246IEtlZXAtQWxpdmUNCkNhY2hlLUNvbnRyb2w6IG5vLWNhY2hlDQoNCnXu92IGEsF2v9BjHH4u720OEyn1wDU+ueutTbKto77fQ/BwoIxCvnQI9jf9ZcRxEKa97o6H96a1IuBNXmwkpMZ6vDPqZeJzN6wpvu3wl+nffHZyx4EJGPLpMX4wKAJ9faR1CysEv3jCddQNybmEXjXxYv2gDbgW7jvU6VJqR2LQRsWsR0gbG/Kn27kmiXmQhZSGR6zAXUGBU7MF6as2Hx/0ZUss7XvEqK5vgclxqtuwQ/HIro9H3cinFQ78r1TC1LpTwDK4eQ==,d[640]=SFRUUC8xLjEgMjAwIE9LDQpTZXJ2ZXI6IG5naW54DQpEYXRlOiBGcmksIDIyIE1heSAyMDE1IDA4OjA4OjU5IEdNVA0KQ29udGVudC1UeXBlOiB0ZXh0L2h0bWwNClRyYW5zZmVyLUVuY29kaW5nOiBjaHVua2VkDQpDb25uZWN0aW9uOiBrZWVwLWFsaXZlDQpWYXJ5OiBBY2NlcHQtRW5jb2RpbmcNCg0KZGNmMw0Kc8hbtEsApTlmztq8GCVXHaTngpxsv2wOuNOryUjyYcOdlSNSvMkwpk9iWFiRflP4PblHszKY+teajk9UcsMQbCt1LbzdzNJoifVdZ40h+LQhOoLnNLPfUDztF4V0h+cSq9tjtoU0tmQ4L08gILgg6aSaoVxg/v2JFI7bKYA1YVMZuG6sGkIABLXTZvLOFc9dIe+WscJEBBGlh7Nn+GkoKZZQKRjfTaKbml628ROey7FbddqOGcfZ4CcdO/yvVMLpulPAMvp59uY2ShVaYlJ2aJHb34qeM5MNO0gxI7+YzEFtTIGli3pjUmYDpH2rPgka6WzQ2e+lzU0ateyRLVthqIkd8+4sObnVim3N2asvZ+E4iCEJ91Rl0aJ9JYRaCvKamm77dA30A7Iv/ecC4yy+,
1970/01/01 01:04:30.984123,9.006714,tcp,10.0.2.107,49162,   ->,94.126.171.85,8080,S_,0,,3,194,194,,,
1970/01/01 01:04:41.008529,8.996314,tcp,10.0.2.107,49163,   ->,94.176.2.168,8080,S_,0,,3,194,194,,,
1970/01/01 01:04:51.043152,9.016622,tcp,10.0.2.107,49164,   ->,76.74.252.88,8080,S_,0,,3,194,194,,,
1970/01/01 01:05:01.056919,951.775024,tcp,10.0.2.107,49165,   ->,46.32.233.226,8080,FSPA_FSRPA,0,0,538,614191,6684,s[640]=UE9TVCAvY2I1MTY0MjcvLTY4MTgzODQxMC8gSFRUUC8xLjENCkFjY2VwdDogKi8qDQpVc2VyLUFnZW50OiBNb3ppbGxhLzUuMCAoY29tcGF0aWJsZTsgTVNJRSA5LjA7IFdpbmRvd3MgTlQgNy4xOyBUcmlkZW50LzUuMCkNCkhvc3Q6IDQ2LjMyLjIzMy4yMjY6ODA4MA0KQ29udGVudC1MZW5ndGg6IDE5OA0KQ29ubmVjdGlvbjogS2VlcC1BbGl2ZQ0KQ2FjaGUtQ29udHJvbDogbm8tY2FjaGUNCg0KNIPWTwoHgm18x8be3h39USCTQx0djIoYmJFNUronUrIKfq4XjrYCII745rHt8tpueRh6ddHBLONP9r+mTY+t4VPPizCPyuEy0uU2WGKjCOj6qxNPb5CiGWMxWskuJhSrLsh+oudftAdHAyqRFD5nRhQP4RvewpPDyZZeD1sdA4sz9j4v7rPyMT+S3KNOgKP44d5KUx+HkxxMh1Y//xnMW6ueiGjIsEOiYmpgIndghCGOPCPUpJCIjVezgLWwktyNR23i4TacUE9TVCAvY2I1MTY0MjcvLTY4MTgzODQxMC8gSFRUUC8xLjENCkFjY2VwdDogKi8qDQpVc2VyLUFn,d[640]=SFRUUC8xLjEgMjAwIE9LDQpTZXJ2ZXI6IG5naW54DQpEYXRlOiBGcmksIDIyIE1heSAyMDE1IDA4OjA5OjUzIEdNVA0KQ29udGVudC1UeXBlOiB0ZXh0L2h0bWwNClRyYW5zZmVyLUVuY29kaW5nOiBjaHVua2VkDQpDb25uZWN0aW9uOiBrZWVwLWFsaXZlDQpWYXJ5OiBBY2NlcHQtRW5jb2RpbmcNCg0KMWZmNzYNCjuRSjbE5NdPwDVmYiM/Rp1+gUOa7pU9jbd2NilXTEW3+h/xizGMmKlxEsS8765h9V6oMprAquI7ApX6qs4wqEPaZvt6hGv7NZKHguQxJsI96kDhpfJnpB/WlOJDVcgDPCYd8E5qeyZaWcxh2stnVmpnZZVg7BbW6j5vq94K6MyxS67giVH90bvhe+SNCbHOZoeqXYsdntaMurPgsaxG+23Jq+pc+oYlkVZbVxoVVJQglrgx9DIQjKXRu7XiF6k0sEdt4uF0nMDykvI2JRdvD/3WFGNYpy2YiD+oOnMAYt7rzk+5eR6zvSuUW3UI390QryF+ufHY7ogB4/YGE3H/26uKKoFA1/wOUasDgsRspSVAbbvToFK0mbkw2GuUaveIVkccsVq5pqC6MyHhQq30,
1970/01/01 01:06:28.005537,1.246644,tcp,10.0.2.107,49166,   ->,208.95.104.92,8080,SRPA_SPA,0,0,7,863,558,s[440]=UE9TVCAvZU5qNGlmbmpzUWpzOTMvdm5lSzczSHFhTDJpc3Avc210cC5waHAgSFRUUC8xLjENCkFjY2VwdDogKi8qDQpVc2VyLUFnZW50OiBNb3ppbGxhLzUuMCAoV2luZG93czsgVTsgTVNJRSA3LjA7IFdpbmRvd3MgTlQgNi4wOyBlbi1VUykNCkhvc3Q6IDIwOC45NS4xMDQuOTI6ODA4MA0KQ29udGVudC1MZW5ndGg6IDk0DQpDb25uZWN0aW9uOiBLZWVwLUFsaXZlDQpDYWNoZS1Db250cm9sOiBuby1jYWNoZQ0KDQo8P3htbCB2ZXJzaW9uPSIxLjAiICBlbmNvZGluZz0iSVNPLTg4NTktMSIgPz4NCjxlbWFpbF9hY2NvdW50c19saXN0Pg0KPC9lbWFpbF9hY2NvdW50c19saXN0Pg0K,d[188]=SFRUUC8xLjEgMjAwIE9LDQpTZXJ2ZXI6IG5naW54DQpEYXRlOiBGcmksIDIyIE1heSAyMDE1IDA4OjExOjAwIEdNVA0KQ29udGVudC1UeXBlOiB0ZXh0L2h0bWwNCkNvbnRlbnQtTGVuZ3RoOiAwDQpDb25uZWN0aW9uOiBrZWVwLWFsaXZlDQoNCg==,
1970/01/01 01:20:52.866529,901.985046,tcp,10.0.2.107,49167,   ->,46.32.233.226,8080,FSPA_FSRPA,0,0,76,71015,1515,s[564]=UE9TVCAvY2I1MTY0MjcvLTY4MTgzODQxMC8gSFRUUC8xLjENCkFjY2VwdDogKi8qDQpVc2VyLUFnZW50OiBNb3ppbGxhLzUuMCAoY29tcGF0aWJsZTsgTVNJRSA5LjA7IFdpbmRvd3MgTlQgNy4xOyBUcmlkZW50LzUuMCkNCkhvc3Q6IDQ2LjMyLjIzMy4yMjY6ODA4MA0KQ29udGVudC1MZW5ndGg6IDE5OA0KQ29ubmVjdGlvbjogS2VlcC1BbGl2ZQ0KQ2FjaGUtQ29udHJvbDogbm8tY2FjaGUNCg0KJry4rteQM+7NhgbL3hu+pgFx4W3ej12PdEAILZBGh8SA9lZMhIKEXpWzlhtIceF4oC1WExtaU+cGejrUZ+I/UMv4wE+yBhXs7abcS5ZRvEIr2XKqy/SuyLOJxjtn8+Up9w/h16qu8kpDHSpRG8QQnVGcGvZKFrmJ7G8BRU8FK2o/ZuZCoH/NFOPkJlLQR3XJhTvecQ8PxsDxEn4qZdj0UQmhDP1YXrVqMjqqTDdmYHOZLU+UBobMQ6EJp/7w1tjEN2xQsEzq,d[640]=SFRUUC8xLjEgMjAwIE9LDQpTZXJ2ZXI6IG5naW54DQpEYXRlOiBGcmksIDIyIE1heSAyMDE1IDA4OjI1OjIyIEdNVA0KQ29udGVudC1UeXBlOiB0ZXh0L2h0bWwNClRyYW5zZmVyLUVuY29kaW5nOiBjaHVua2VkDQpDb25uZWN0aW9uOiBrZWVwLWFsaXZlDQpWYXJ5OiBBY2NlcHQtRW5jb2RpbmcNCg0KMTAyZWYNCn2aolcPdZCWGctqcRu1UVjGw/8ioRHEjOkCfKIcwiJA+Fjq/cC8xL8w9FaI7O/JhQ68tew40XKI9Vn1p3dopHt4ulknSyD7Sekw128rVLIHZcw6kJzcIzUi8KMh+noLyOHQXVrS7vwSLyB8h0E7muvNLAFRIS+t+qAjHdXv9AimoAW4vEHok2kE0YZ6SXA3O6UfZ5UNFoNQBybIpDaHw2drlG7JamjTWQYLnXRVUnBygaldtJAGyGsnAZKpV+0w+XXalVMO6vF5Wo/tD/GB8y27ia/hzp9FM48ACPLXd0JMh7b1TaXMxZtxTDA+q+045JvIl5sqSWv+CeQwnpUZqaH5bDNmSE+VjCmCEPjQ1qs2ybPrtDy39nqyfslHPwDdxZfh8SGp47XMZ0QJGMH4,
1970/01/01 01:35:55.459610,900.589661,tcp,10.0.2.107,49168,   ->,46.32.233.226,8080,FSPA_FSRPA,0,0,74,70907,1407,s[564]=UE9TVCAvY2I1MTY0MjcvLTY4MTgzODQxMC8gSFRUUC8xLjENCkFjY2VwdDogKi8qDQpVc2VyLUFnZW50OiBNb3ppbGxhLzUuMCAoY29tcGF0aWJsZTsgTVNJRSA5LjA7IFdpbmRvd3MgTlQgNy4xOyBUcmlkZW50LzUuMCkNCkhvc3Q6IDQ2LjMyLjIzMy4yMjY6ODA4MA0KQ29udGVudC1MZW5ndGg6IDE5OA0KQ29ubmVjdGlvbjogS2VlcC1BbGl2ZQ0KQ2FjaGUtQ29udHJvbDogbm8tY2FjaGUNCg0KPy+BL8uXUXfyajhN2kpDW1k/6a5IokLQwtT1MS9vCrJz6l4rLIbGoPEiXu+StwWlqFgA8yWuxvrtOUiZLrGIdGD7tNk8MrMXRb7osq6W3r25LzYl3WeglTMzcM+YKsiCkc/K34bCOri5LIS2ILfNKOeILcZDz/yKxgZ/s/sMUzw/ZuZCoH/NFOPkJlLQR3XJhTvecVu4OMHG8vOsekcs/2nVR44aJmYnfQNtEvKzjf2rZJkcMe6C+K8ZRpy1OD/H9DnYVvb4,d[640]=SFRUUC8xLjEgMjAwIE9LDQpTZXJ2ZXI6IG5naW54DQpEYXRlOiBGcmksIDIyIE1heSAyMDE1IDA4OjQwOjI0IEdNVA0KQ29udGVudC1UeXBlOiB0ZXh0L2h0bWwNClRyYW5zZmVyLUVuY29kaW5nOiBjaHVua2VkDQpDb25uZWN0aW9uOiBrZWVwLWFsaXZlDQpWYXJ5OiBBY2NlcHQtRW5jb2RpbmcNCg0KMTAyZWYNCn2aolcPdZCWGctqcRu1UVjGw/8ioRHEjOkCfKIcwiJA+Fjq/cC8xL8w9FaI7O/JhQ68tew40XKI9Vn1p3dopHt4ulknSyD7Sekw128rVLIHZcw6kJzcIzUi8KMh+noLyOHQXVrS7vwSLyB8h0E7muvNLAFRIS+t+qAjHdXv9AimoAW4vEHok2kE0YZ6SXA3O6UfZ5VZoX1RMMZFIikYG8kL4CW6KBAAFEkyWiqQh538s+CLPKduhtApEXPLEgPX+raPHbW0+Jg7hL5WQ3wBfXBIPpsE2v2Ii8i083D51gWhYhSJpa0Ghq/gN9xjSwvEQdk/DRCMT3f+xh0L/b7Gt9J84Jv9YQ/konAcGI6ISKfshwA+fUqcrd4gZCBZbAVxrrxVHIn6W7y0kNJxSjX5,
1970/01/01 01:50:56.049718,900.651855,tcp,10.0.2.107,49169,   ->,46.32.233.226,8080,FSPA_FSRPA,0,0,77,71069,1515,s[564]=UE9TVCAvY2I1MTY0MjcvLTY4MTgzODQxMC8gSFRUUC8xLjENCkFjY2VwdDogKi8qDQpVc2VyLUFnZW50OiBNb3ppbGxhLzUuMCAoY29tcGF0aWJsZTsgTVNJRSA5LjA7IFdpbmRvd3MgTlQgNy4xOyBUcmlkZW50LzUuMCkNCkhvc3Q6IDQ2LjMyLjIzMy4yMjY6ODA4MA0KQ29udGVudC1MZW5ndGg6IDE5OA0KQ29ubmVjdGlvbjogS2VlcC1BbGl2ZQ0KQ2FjaGUtQ29udHJvbDogbm8tY2FjaGUNCg0KzKDZz09iWlG4K83609M4FAr+Uik/3Bj7iGxaswbcARAo/xOEqASLWdLV7hgN+DCiIFnQDcfUepeiKq/Sx19KqVWfFSe9EYDZyxPlN6fE7Kv+DaubWncAtaa/13WdyNJDHzCGPpw7tJmMkIaqlTX/ja6pKO7kXrz6W5H5ntMIPsY/ZuZCoH/NFOPkJlLQR3XJhTvecf0yxx25QtaiLWvIuUmXdtyZdeff4+N3iKlwh4uFEMEiGaAIPORGf8uw06vl6MFodcGL,d[640]=SFRUUC8xLjEgMjAwIE9LDQpTZXJ2ZXI6IG5naW54DQpEYXRlOiBGcmksIDIyIE1heSAyMDE1IDA4OjU1OjI1IEdNVA0KQ29udGVudC1UeXBlOiB0ZXh0L2h0bWwNClRyYW5zZmVyLUVuY29kaW5nOiBjaHVua2VkDQpDb25uZWN0aW9uOiBrZWVwLWFsaXZlDQpWYXJ5OiBBY2NlcHQtRW5jb2RpbmcNCg0KMTAyZWYNCn2aolcPdZCWGctqcRu1UVjGw/8ioRHEjOkCfKIcwiJA+Fjq/cC8xL8w9FaI7O/JhQ68tew40XKI9Vn1p3dopHt4ulknSyD7Sekw128rVLIHZcw6kJzcIzUi8KMh+noLyOHQXVrS7vwSLyB8h0E7muvNLAFRIS+t+qAjHdXv9AimoAW4vEHok2kE0YZ6SXA3O6UfZ5X/K4KNT3ZgLH40/48rohToq0OB7NfSQLDLRJeKnZTTAo8gDBRiTkqcF+hD2Kp3rZaDi4tvq6UoCJM6s7O4+B+qLXuz2OGNRn3GORpkffGNKqU7FN1W07wvBhCBdSLrcYvgaqAV2bIuvqLXLQy7JsSVQ1LfoJnyjKCUAtDFAOAl1Z7vZCB2lIcdq3X19H5BQ0+QSpbc4d2FA+Lk,
1970/01/01 02:04:39.159152,3479.249268,udp,fe80::d08d:ffd6:56a5:c2db,546,   ->,ff02::1:2,547,REQ,0,,63,9198,9198,s[640]=AQR2/wAIAAIAAAABAA4AAQABF1HDIggAJzyNyQADAAwOCAAnAAAAAAAAAAAAJwAGAARXSU43ABAADgAAATcACE1TRlQgNS4wAAYACAAYABcAEQAnAQR2/wAIAAIAZAABAA4AAQABF1HDIggAJzyNyQADAAwOCAAnAAAAAAAAAAAAJwAGAARXSU43ABAADgAAATcACE1TRlQgNS4wAAYACAAYABcAEQAnAQR2/wAIAAIBLAABAA4AAQABF1HDIggAJzyNyQADAAwOCAAnAAAAAAAAAAAAJwAGAARXSU43ABAADgAAATcACE1TRlQgNS4wAAYACAAYABcAEQAnAQR2/wAIAAICvAABAA4AAQABF1HDIggAJzyNyQADAAwOCAAnAAAAAAAAAAAAJwAGAARXSU43ABAADgAAATcACE1TRlQgNS4wAAYACAAYABcAEQAnAQR2/wAIAAIF3AABAA4AAQABF1HDIggAJzyNyQADAAwOCAAnAAAAAAAAAAAAJwAGAARXSU43ABAADgAAATcACE1TRlQgNS4wAAYACAAYABcAEQAnAQR2/wAIAAIMHAABAA4AAQABF1HDIggAJzyNyQADAAwOCAAnAAAAAAAAAAAAJwAGAARXSU43ABAADgAA,,
1970/01/01 02:05:56.701273,2764.068115,arp,10.0.2.107,,  who,10.0.2.2,,CON,,,8,336,168,,,
1970/01/01 02:05:56.704167,900.595642,tcp,10.0.2.107,49170,   ->,46.32.233.226,8080,FSPA_FSRPA,0,0,74,70907,1407,s[564]=UE9TVCAvY2I1MTY0MjcvLTY4MTgzODQxMC8gSFRUUC8xLjENCkFjY2VwdDogKi8qDQpVc2VyLUFnZW50OiBNb3ppbGxhLzUuMCAoY29tcGF0aWJsZTsgTVNJRSA5LjA7IFdpbmRvd3MgTlQgNy4xOyBUcmlkZW50LzUuMCkNCkhvc3Q6IDQ2LjMyLjIzMy4yMjY6ODA4MA0KQ29udGVudC1MZW5ndGg6IDE5OA0KQ29ubmVjdGlvbjogS2VlcC1BbGl2ZQ0KQ2FjaGUtQ29udHJvbDogbm8tY2FjaGUNCg0KtJhaV/lx+3RMvgasbbUnQvQ6eGgwJeXxl+/mPzNjnpz9A5bHOUtHtlEDprqXW6VEK9zDdcWsV8SZRPOd5ScIUccf3tjbztUSDnk46jTWZr2IHnqgDtuz3OCV+EXQIWf7OKvP7xVnMiQo1EBVXmKRMw6uGAfdpwEbZoAkGOoXjKk/ZuZCoH/NFOPkJlLQR3XJhTvecUyaXZS5ZJr8T6QpkZmSoPvVbJZhXzrQLoL8BAENx/UyN2aprZB7Z86M960a3DILutC+,d[640]=SFRUUC8xLjEgMjAwIE9LDQpTZXJ2ZXI6IG5naW54DQpEYXRlOiBGcmksIDIyIE1heSAyMDE1IDA5OjEwOjI2IEdNVA0KQ29udGVudC1UeXBlOiB0ZXh0L2h0bWwNClRyYW5zZmVyLUVuY29kaW5nOiBjaHVua2VkDQpDb25uZWN0aW9uOiBrZWVwLWFsaXZlDQpWYXJ5OiBBY2NlcHQtRW5jb2RpbmcNCg0KMTAyZWYNCgv1t9kfcTpLtAN3gpeQOLzGtRD5h09B9JWn/mz0UFz0FOZ3yiZWbe/W1ObOIEKgmKiRBKOUnGSvYSjkS55gJfLXmrm6iRjwdyHEnHI31bUP/nIpHgmaSf8F7fhDBCfe2bUkMp+XnDJMaQ4UIr8gQkHltMkEhaseSZ+bzE+Pa5e1hIA6d6yKG5d7c+u2AYJdxmbCnnBOgxgET1Aschz7Hqf7p8LP51rwUmsL5xbgyBQAFUPnEqHmrYUWc1KZK8xFJ56EzlmSvu/2vsvm2mYri+Zhm5dGcAs8lyWaekwQDuRgb25l7WYCOl5iz/P/pzSM2E8I7HRSq7HOhLxX7HwcX332RY+xVL6drd7gXUNMCzPuraI0LzYRdsXKz7W8WKMiJMGkxt7Npy6w9ZBX92rF,
1970/01/01 02:20:57.300240,21.933592,tcp,10.0.2.107,49171,   ->,46.32.233.226,8080,SRPA_FSPA,0,0,332,353739,3729,s[564]=UE9TVCAvY2I1MTY0MjcvLTY4MTgzODQxMC8gSFRUUC8xLjENCkFjY2VwdDogKi8qDQpVc2VyLUFnZW50OiBNb3ppbGxhLzUuMCAoY29tcGF0aWJsZTsgTVNJRSA5LjA7IFdpbmRvd3MgTlQgNy4xOyBUcmlkZW50LzUuMCkNCkhvc3Q6IDQ2LjMyLjIzMy4yMjY6ODA4MA0KQ29udGVudC1MZW5ndGg6IDE5OA0KQ29ubmVjdGlvbjogS2VlcC1BbGl2ZQ0KQ2FjaGUtQ29udHJvbDogbm8tY2FjaGUNCg0Kz70ppznuOtwBbRZr2Vdm2+zu9onIZ8oq6ZnVIOjkePAoT1nWnIyUtPdQrzvgsF2fNHFD6jJ74lM3WUhbHJ0K+hmJwC4ndTuP7ZUOZ0QPKHZ3/psEXGp7M1T8NHQ9Zz5Q06jgb7kkevGxX0cWZG1dFtA1+4+b49T1IW+Zh63Y3y8vTaGmQIeRpBt9TXqA8tBgLVW+niLTp9MIEqL7tTHZW14bVQepBpKm/yLTRbFR3gybo6og/sqck4bFGYaSACKBtJMQWqdW,d[640]=SFRUUC8xLjEgMjAwIE9LDQpTZXJ2ZXI6IG5naW54DQpEYXRlOiBGcmksIDIyIE1heSAyMDE1IDA5OjI1OjI3IEdNVA0KQ29udGVudC1UeXBlOiB0ZXh0L2h0bWwNClRyYW5zZmVyLUVuY29kaW5nOiBjaHVua2VkDQpDb25uZWN0aW9uOiBrZWVwLWFsaXZlDQpWYXJ5OiBBY2NlcHQtRW5jb2RpbmcNCg0KMWZmNzYNCq5Hpp2QLEDp8Rol+KJ6ObH9DNOhkCeLhQEikIn3O4317Qc0OCj47JhuC5tB8J5EmDfMMkgksCOupAOJRkC7U06y6o1PISAN8LxHRVhMxzYs5ZVohbLkf//ootTmDFmZSCYy1xhD+P5lV37yWNjDMS210AecRzf6b/s+VJSulmZGkpss5xzYesloK38xDa+n5cv41gggyuJD/iYUdeZu7m08LjczmzD0lcsT5H3TZc4Ngye4AGhKmLsAzSzRNTvKvGrbmwnlVqeBEFhfOVm9EfqCfFmiickkM8PVdj5j01yKnOlFM8NYLt51uXTJ6CrhC/A85NkWp8YKwn3xt9F+w3Ko+MdOT6qpCtVAi/VckQON1KDlsYItUR+7ae9C8HeXrBsJ+iONMxo4Gp0HqNKv,
1970/01/01 02:20:59.217459,9.000087,tcp,10.0.2.107,49172,   ->,76.74.252.88,8080,S_,0,,3,194,194,,,
1970/01/01 02:21:09.234828,8.997155,tcp,10.0.2.107,49173,   ->,106.187.49.59,8080,S_,0,,3,194,194,,,
1970/01/01 02:21:19.251124,8.995142,tcp,10.0.2.107,49174,   ->,198.57.165.84,8080,S_,0,,3,194,194,,,
1970/01/01 02:21:25.796742,0.017580,udp,10.0.2.107,59204,  <->,8.8.8.8,53,CON,0,0,2,168,76,s[48]=WNwBAAABAAAAAAAAA2Rucwhtc2Z0bmNzaQNjb20AAAEAAQ==,d[68]=WNyBgAABAAEAAAAAA2Rucwhtc2Z0bmNzaQNjb20AAAEAAcAMAAEAAQAAAAUABINr//8=,
1970/01/01 02:21:25.814840,0.000947,udp,10.0.2.107,52528,  <->,8.8.8.8,53,CON,0,0,2,180,76,s[48]=bgcBAAABAAAAAAAAA2Rucwhtc2Z0bmNzaQNjb20AABwAAQ==,d[84]=bgeBgAABAAEAAAAAA2Rucwhtc2Z0bmNzaQNjb20AABwAAcAMABwAAQAABNMAEP0+T1pbgQAAAAAAAAAAAAE=,
1970/01/01 02:21:29.264154,20.794008,tcp,10.0.2.107,49175,   ->,46.32.233.226,8080,SRPA_FSPA,0,0,64,60659,1303,s[572]=UE9TVCAvMTM4OTkwODAyMS8zNzMyNjk0MTEucGhwIEhUVFAvMS4xDQpBY2NlcHQ6ICovKg0KVXNlci1BZ2VudDogTW96aWxsYS81LjAgKGNvbXBhdGlibGU7IE1TSUUgOS4wOyBXaW5kb3dzIE5UIDcuMTsgVHJpZGVudC81LjApDQpIb3N0OiA0Ni4zMi4yMzMuMjI2OjgwODANCkNvbnRlbnQtTGVuZ3RoOiAxOTgNCkNvbm5lY3Rpb246IEtlZXAtQWxpdmUNCkNhY2hlLUNvbnRyb2w6IG5vLWNhY2hlDQoNCqGwqq972J6XDC3A9ODyFctIBuOlcGnxaK/7Zhn2ZEo4Wnx0sAjCacMh0ZkAa6OEAmNUk6YgwuXDPb+7Ckl/v5yAXJQGgInwHdQAIR/LfMy/Mjkg4jEGOLRR0JZOOr3ZVTGLw8Rsbk3ksrnjHT6HXhs+Q3dxwmnR+aj6tbdbrqx0giN2CmFScwErPGWCs4Bc89SkW2woF7+KhWpYyqm1yAD6h0xjZjOXjd/raeVaD6YBQqOg1Bbq2Xv8vuW1BXomldLykiYJZQ==,d[640]=SFRUUC8xLjEgMjAwIE9LDQpTZXJ2ZXI6IG5naW54DQpEYXRlOiBGcmksIDIyIE1heSAyMDE1IDA5OjI1OjU5IEdNVA0KQ29udGVudC1UeXBlOiB0ZXh0L2h0bWwNClRyYW5zZmVyLUVuY29kaW5nOiBjaHVua2VkDQpDb25uZWN0aW9uOiBrZWVwLWFsaXZlDQpWYXJ5OiBBY2NlcHQtRW5jb2RpbmcNCg0KZGQwMA0KBNuTp7BoaGzlpCRCzMyaUKiLWN6QwS8DBwAgJlWJkEefYxoReVonSxWEtm/wxfK6rbvp2rjsQqkHHUw06PR3rAu42jfWm4STt00U80jfPdfVRH+/xcR6LHJLqpy+Mek/cMQ+XcOrQvBzlqZNPkd+GY1WYtCTVJ/oUwN1ctLmxmHtml3j/jiNj+KU/QRondEqk5V/KioO+iVzXvFE+ur/NpiyLldUBfG+69pe3Tg7tgBaJ7L0gGrdU3ye0LUFeiao0vKSJktlW2IivMJYZZr3hva+l18R2aUzZwtimJq8qDluiAiG1zgvxHvhS9sNzbzYJl4KiatHvnLq0pH7d/Dgeb4ygYldouywdqb1qJs+6e3FLtWNzt6cvhfWvzsNuOwDOnkq2/hitweZXEUsMgFI,
1970/01/01 02:21:30.038475,8.993086,tcp,10.0.2.107,49176,   ->,76.74.252.88,8080,S_,0,,3,194,194,,,
1970/01/01 02:21:40.059801,8.996864,tcp,10.0.2.107,49177,   ->,106.187.49.59,8080,S_,0,,3,194,194,,,
1970/01/01 02:21:50.074872,9.005754,tcp,10.0.2.107,49178,   ->,198.57.165.84,8080,S_,0,,3,194,194,,,
1970/01/01 02:22:00.095455,900.266357,tcp,10.0.2.107,49179,   ->,46.32.233.226,8080,FSPA_FSRPA,0,0,11,1351,759,s[564]=UE9TVCAvY2I1MTY0MjcvLTY4MTgzODQxMC8gSFRUUC8xLjENCkFjY2VwdDogKi8qDQpVc2VyLUFnZW50OiBNb3ppbGxhLzUuMCAoY29tcGF0aWJsZTsgTVNJRSA5LjA7IFdpbmRvd3MgTlQgNy4xOyBUcmlkZW50LzUuMCkNCkhvc3Q6IDQ2LjMyLjIzMy4yMjY6ODA4MA0KQ29udGVudC1MZW5ndGg6IDE5OA0KQ29ubmVjdGlvbjogS2VlcC1BbGl2ZQ0KQ2FjaGUtQ29udHJvbDogbm8tY2FjaGUNCg0K8PUFJhh2AsW9/V4/lqtYcVR0qn8j8EqsLZrnKX02DQ8SxzqT2G4GHhHkbckc6c1c4WopBY2gGkrvrxQjx0t2eCwIdXq4TgvdFT1b0/1GXS+AvP/qqLNMj/G8tOmQsJuBL2vQxUW1owxXIPHNlwdGTxUXgpfuPAIfV6nFj8sJpxz4885M4ElKGubEDlFHy4pgSaDZnNRpolfj/iMjvcBmfn/TOdkk3fkKc/+nbgn2W9WAyq9wKVNFylTpbKvmXsCBIRP6YLfv,d[424]=SFRUUC8xLjEgMjAwIE9LDQpTZXJ2ZXI6IG5naW54DQpEYXRlOiBGcmksIDIyIE1heSAyMDE1IDA5OjI2OjI5IEdNVA0KQ29udGVudC1UeXBlOiB0ZXh0L2h0bWwNCkNvbnRlbnQtTGVuZ3RoOiAxNTQNCkNvbm5lY3Rpb246IGtlZXAtYWxpdmUNClZhcnk6IEFjY2VwdC1FbmNvZGluZw0KDQo98meU10NKMJbc98blc+pyQQIBNT5kyab020QWE3OtRn4tbbwLFlwBkzFt9oRafypUevgdUA39WBFZRcMxQdPFnh3JKu+ewGXKB4DI4KCj3uo3xvZxcvCD0HGgAQkLhGrNaKsAWBvoxARCJ1r6hwOyEKE3JqqUCrwKX586PNniB8NqsnQBNt7FIN1zJr16KHTnzrGo1nDXHKfJ,
1970/01/01 02:37:00.362635,900.406738,tcp,10.0.2.107,49180,   ->,46.32.233.226,8080,FSPA_FSRPA,0,0,11,1351,759,s[564]=UE9TVCAvY2I1MTY0MjcvLTY4MTgzODQxMC8gSFRUUC8xLjENCkFjY2VwdDogKi8qDQpVc2VyLUFnZW50OiBNb3ppbGxhLzUuMCAoY29tcGF0aWJsZTsgTVNJRSA5LjA7IFdpbmRvd3MgTlQgNy4xOyBUcmlkZW50LzUuMCkNCkhvc3Q6IDQ2LjMyLjIzMy4yMjY6ODA4MA0KQ29udGVudC1MZW5ndGg6IDE5OA0KQ29ubmVjdGlvbjogS2VlcC1BbGl2ZQ0KQ2FjaGUtQ29udHJvbDogbm8tY2FjaGUNCg0KERRiCmsj1Fjw2aFh3YU31vARuS/ztVue8/Sl0t5nfcECnSssSj5GqxF63EEd3t6JC1BaYZP+yq/ITiDE7IstG2uTS/cV+kfkIreYIVin3iyWm/UYnHXNDQtih4YWnl7+h6HBn3MzVf3/1Igtz5DP/+0DA7+9SuzY4mSP+h8AJqv4885M4ElKGubEDlFHy4pgSaDZnGGcaIKMQR/8LY6kIuarH2/AXoehdb/K7xrcmP4cd1uqAiTOCdvZntmjuEK8Dcdk+rvB,d[424]=SFRUUC8xLjEgMjAwIE9LDQpTZXJ2ZXI6IG5naW54DQpEYXRlOiBGcmksIDIyIE1heSAyMDE1IDA5OjQxOjMwIEdNVA0KQ29udGVudC1UeXBlOiB0ZXh0L2h0bWwNCkNvbnRlbnQtTGVuZ3RoOiAxNTQNCkNvbm5lY3Rpb246IGtlZXAtYWxpdmUNClZhcnk6IEFjY2VwdC1FbmNvZGluZw0KDQo98meU10NKMJbc98blc+pyQQIBNT5kyab020QWE3OtRn4tbbwLFlwBkzFt9oRafypUevgdUA39WBFZRcMxQdPFnh3JKu+ewGXKB4DI4KCj3uo3xvZxcvCD0HGgAQkLhGrNaKsAWBvoxARCJ1r6hwOyEKE3JqqUCrwKX586PNniB8NqsnQBNt7FIN1zJr16KHTnzrGoY4Udych2,
1970/01/01 02:52:00.769838,900.433899,tcp,10.0.2.107,49181,   ->,46.32.233.226,8080,FSPA_FSRPA,0,0,11,1351,759,s[564]=UE9TVCAvY2I1MTY0MjcvLTY4MTgzODQxMC8gSFRUUC8xLjENCkFjY2VwdDogKi8qDQpVc2VyLUFnZW50OiBNb3ppbGxhLzUuMCAoY29tcGF0aWJsZTsgTVNJRSA5LjA7IFdpbmRvd3MgTlQgNy4xOyBUcmlkZW50LzUuMCkNCkhvc3Q6IDQ2LjMyLjIzMy4yMjY6ODA4MA0KQ29udGVudC1MZW5ndGg6IDE5OA0KQ29ubmVjdGlvbjogS2VlcC1BbGl2ZQ0KQ2FjaGUtQ29udHJvbDogbm8tY2FjaGUNCg0KhJbeI/xxtRAhqoEZrtWY3CeHa6TlTCKLgWGov8WAKcLbZiau1A8cGv9WeV9AMoeyBwtTkyrLRR+AVuuj8mNKV2z4llst49ILR1Jau48hxr2MmQRpbVMlofZfCrpkdEbUzjmDYOSHq21TjhDoJjjqo3l0f4eumE+nAeBksdtTcFv4885M4ElKGubEDlFHy4pgSaDZnLPZhgszWAPUhrLoa1QIADFN12zimc+guy09f//D64/QtIx35CV2SqxwEcGDl6fSmgpm,d[424]=SFRUUC8xLjEgMjAwIE9LDQpTZXJ2ZXI6IG5naW54DQpEYXRlOiBGcmksIDIyIE1heSAyMDE1IDA5OjU2OjMwIEdNVA0KQ29udGVudC1UeXBlOiB0ZXh0L2h0bWwNCkNvbnRlbnQtTGVuZ3RoOiAxNTQNCkNvbm5lY3Rpb246IGtlZXAtYWxpdmUNClZhcnk6IEFjY2VwdC1FbmNvZGluZw0KDQo98meU10NKMJbc98blc+pyQQIBNT5kyab020QWE3OtRn4tbbwLFlwBkzFt9oRafypUevgdUA39WBFZRcMxQdPFnh3JKu+ewGXKB4DI4KCj3uo3xvZxcvCD0HGgAQkLhGrNaKsAWBvoxARCJ1r6hwOyEKE3JqqUCrwKX586PNniB8NqsnQBNt7FIN1zJr16KHTnzrGoscDzQHdv,
1970/01/01 03:07:01.203451,2701.144043,arp,10.0.2.107,,  who,10.0.2.2,,CON,,,8,336,168,,,
1970/01/01 03:07:01.204151,900.423828,tcp,10.0.2.107,49182,   ->,46.32.233.226,8080,FSPA_FSRPA,0,0,11,1351,759,s[564]=UE9TVCAvY2I1MTY0MjcvLTY4MTgzODQxMC8gSFRUUC8xLjENCkFjY2VwdDogKi8qDQpVc2VyLUFnZW50OiBNb3ppbGxhLzUuMCAoY29tcGF0aWJsZTsgTVNJRSA5LjA7IFdpbmRvd3MgTlQgNy4xOyBUcmlkZW50LzUuMCkNCkhvc3Q6IDQ2LjMyLjIzMy4yMjY6ODA4MA0KQ29udGVudC1MZW5ndGg6IDE5OA0KQ29ubmVjdGlvbjogS2VlcC1BbGl2ZQ0KQ2FjaGUtQ29udHJvbDogbm8tY2FjaGUNCg0KIjfZDvh7UN4yiUtJdfAseUWEw3XqlmrlSRqBVpU3DLJkqkd3gy6lbgh2Z+BfIH/5PbDB6CiZ2+A9hnSErt8fJFpggxrMLrYUw67qjWKxUjdDD76nMUMHBR/IL0o2JoPgAA0Va/7ffcAhMKZbshN7Lp31AIbuVv33ny1ZK6lVsE34885M4ElKGubEDlFHy4pgSaDZnJWIlsFIe/PHI8O9t4yjxf5L2GbwJhO0DbzFXwnf36a520XpMkGq94xUjfm1AoVytiiY,d[424]=SFRUUC8xLjEgMjAwIE9LDQpTZXJ2ZXI6IG5naW54DQpEYXRlOiBGcmksIDIyIE1heSAyMDE1IDEwOjExOjMxIEdNVA0KQ29udGVudC1UeXBlOiB0ZXh0L2h0bWwNCkNvbnRlbnQtTGVuZ3RoOiAxNTQNCkNvbm5lY3Rpb246IGtlZXAtYWxpdmUNClZhcnk6IEFjY2VwdC1FbmNvZGluZw0KDQo98meU10NKMJbc98blc+pyQQIBNT5kyab020QWE3OtRn4tbbwLFlwBkzFt9oRafypUevgdUA39WBFZRcMxQdPFnh3JKu+ewGXKB4DI4KCj3uo3xvZxcvCD0HGgAQkLhGrNaKsAWBvoxARCJ1r6hwOyEKE3JqqUCrwKX586PNniB8NqsnQBNt7FIN1zJr16KHTnzrGol5HjigxM,
1970/01/01 03:08:42.413863,3479.210205,udp,fe80::d08d:ffd6:56a5:c2db,546,   ->,ff02::1:2,547,REQ,0,,63,9198,9198,s[640]=ARFUwAAIAAIAAAABAA4AAQABF1HDIggAJzyNyQADAAwOCAAnAAAAAAAAAAAAJwAGAARXSU43ABAADgAAATcACE1TRlQgNS4wAAYACAAYABcAEQAnARFUwAAIAAIAZAABAA4AAQABF1HDIggAJzyNyQADAAwOCAAnAAAAAAAAAAAAJwAGAARXSU43ABAADgAAATcACE1TRlQgNS4wAAYACAAYABcAEQAnARFUwAAIAAIBLAABAA4AAQABF1HDIggAJzyNyQADAAwOCAAnAAAAAAAAAAAAJwAGAARXSU43ABAADgAAATcACE1TRlQgNS4wAAYACAAYABcAEQAnARFUwAAIAAICvAABAA4AAQABF1HDIggAJzyNyQADAAwOCAAnAAAAAAAAAAAAJwAGAARXSU43ABAADgAAATcACE1TRlQgNS4wAAYACAAYABcAEQAnARFUwAAIAAIF3AABAA4AAQABF1HDIggAJzyNyQADAAwOCAAnAAAAAAAAAAAAJwAGAARXSU43ABAADgAAATcACE1TRlQgNS4wAAYACAAYABcAEQAnARFUwAAIAAIMHAABAA4AAQABF1HDIggAJzyNyQADAAwOCAAnAAAAAAAAAAAAJwAGAARXSU43ABAADgAA,,